{"text_format":"1","workbook":"xlsx","n_sheets":9,"sheets":["Intro","Ventes","Achats","Timing et RH","Charges fixes","Investissements","Apports","Trésorerie","Tables"],"not_rendered":{"charts":0,"images":2,"macros":1,"external_links":0,"defined_names":59,"comments":0,"pivot_tables":0},"unopened":[],"bounds":{"document_bytes":16777216,"sheet_cells":100000,"rows_first":2000,"rows_last":500,"rows_between":2000,"halvings":0,"cell_chars":16384,"cell_head_chars":4096},"cells_cut":0,"cells_raw":0,"read":"whole","date_system":"1900"}

{"sheet":"Intro","index":0,"n_rows":52,"n_cols":8,"rows_kept":52,"cut":false,"hidden":false,"merged":[[37,1,37,6],[31,0,31,1],[33,1,33,6],[34,1,34,6],[35,1,35,6],[36,1,36,6],[0,0,0,7],[50,1,50,6],[51,1,51,6],[32,1,32,6],[44,1,44,6],[45,1,45,6],[46,1,46,6],[47,1,47,6],[48,1,48,6],[49,1,49,6],[38,1,38,6],[39,1,39,6],[40,1,40,6],[41,1,41,6],[42,1,42,6],[43,1,43,6]]}
["Configuration de la planification\n 1. Indiquez la date du début de la planification (premier jour du mois)\n 2. Choisissez une configuration de planification sur 1, 2 ou 3 ans\n 3. Remplissez les tableaux de préférence dans l'ordre des onglets\n 4. Utilisez la liste d'instructions ci-dessous pour des informations complémentaires"]
[]
[null,"Mois de début de la planification:","2014-08-01"]
[]
[null,"Configuration de la planification:"]
[]
[]
[]
[]
[]
[]
[]
[]
[]
[]
{"$rows_left_out":38}
{"sheet":"Ventes","index":1,"n_rows":226,"n_cols":14,"rows_kept":226,"cut":false,"hidden":false,"merged":[[0,0,0,12],[57,0,58,0],[84,0,85,0],[170,0,171,0],[155,0,156,0],[30,0,31,0],[30,1,30,12],[57,1,57,12],[84,1,84,12],[2,1,3,1],[2,2,3,2],[2,3,2,5],[2,6,2,9],[2,10,2,11],[155,1,155,12],[170,1,170,12],[2,0,3,0],[97,1,97,12],[126,1,126,12],[111,1,111,12],[16,1,16,12],[43,1,43,12],[70,1,70,12],[43,0,44,0],[70,0,71,0],[16,0,17,0],[141,0,142,0],[141,1,141,12],[97,0,98,0],[111,0,112,0],[126,0,127,0],[185,0,186,0],[185,1,185,12],[199,0,200,0],[199,1,199,12],[213,0,214,0],[213,1,213,12]]}
["Définition des prestations et de leur ventes\n 1. Défnissez vos prestations, ainsi que leurs prix de vente, les délais de paiement et la TVA qui s'y applique\n 2. Etablissez ensuite une prévision de leurs vente durant les trois premières années\n 3. Dans le troisième tableau, indiquez toute réduction en pourcentage du prix de vente, telles que remises, prix soldés, perte, etc."]
[]
["Prestations \n(produits ou services)","Unités","Si autre","Prix de vente unitaire en CHF",null,null,"Délais moyens de paiement des clients",null,null,null,"TVA",null,null,"TVA"]
[null,null,null,"Année 1","Année 2","Année 3","Cash","A 30 jours","A 60 jours","A 90 jours","Catégorie","Taux",null,"taux inversé"]
[null,null,null,null,null,null,null,null,null,null,null,{"$f":"IF(K5=\"\",0%,VLOOKUP(K5,TVA,2,FALSE))","v":0},null,{"$f":"$L5/(1+$L5)","v":0}]
[null,null,null,null,null,null,null,null,null,null,null,0,null,{"$f":"$L6/(1+$L6)","v":0}]
[null,null,null,null,null,null,null,null,null,null,null,0,null,0]
[null,null,null,null,null,null,null,null,null,null,null,0,null,0]
[null,null,null,null,null,null,null,null,null,null,null,0,null,0]
[null,null,null,null,null,null,null,null,null,null,null,0,null,0]
[null,null,null,null,null,null,null,null,null,null,null,0,null,0]
[null,null,null,null,null,null,null,null,null,null,null,0,null,0]
[null,null,null,null,null,null,null,null,null,null,null,0,null,0]
[null,null,null,null,null,null,null,null,null,null,null,0,null,0]
["Eventuelles recettes hors exploitation",null,null,null,null,null,null,null,null,null,"Services",0.08,null,7.407407407407407E-2]
{"$rows_left_out":212}
{"sheet":"Achats","index":2,"n_rows":245,"n_cols":18,"rows_kept":245,"cut":false,"hidden":false,"merged":[[0,0,0,12],[186,0,187,0],[160,0,161,0],[160,1,160,12],[173,1,173,12],[186,1,186,12],[134,1,134,12],[147,1,147,12],[134,0,135,0],[147,0,148,0],[173,0,174,0],[108,1,108,12],[95,0,96,0],[2,10,2,11],[2,6,2,9],[2,3,2,5],[2,15,2,17],[199,1,199,12],[214,1,214,12],[2,0,3,0],[2,1,3,1],[2,2,3,2],[108,0,109,0],[121,0,122,0],[121,1,121,12],[82,0,83,0],[82,1,82,12],[95,1,95,12],[230,1,230,12],[199,0,200,0],[214,0,215,0],[230,0,231,0],[14,6,14,9],[14,1,14,2],[54,0,55,0],[54,1,54,12],[40,0,41,0],[40,1,40,12],[68,0,69,0],[68,1,68,12]]}
["Définition de la composition des prestations et calcul des achats\n 1. Définissez les composants des prestations, avec leurs unités, prix d'achat, délais de paiement et la TVA qui s'y applique\n 2. Définissez les délais de livraison et conditions de stock, y compris d'éventuels stocks initiaux\n 3. Montez le tableau croisé définissant les quantités de composants entrant dans la production de chaque prestation"]
[]
["Composants des prestations","Unités","Si autre","Prix d'achat unitaire en CHF",null,null,"Délais moyens de paiement  fournisseurs",null,null,null,"TVA",null,null,"TVA",null,"Prix d'achat unitaire en CHF"]
[null,null,null,"Année 1","Année 2","Année 3","Cash","A 30 jours","A 60 jours","A 90 jours","Catégorie","Taux",null,"taux inversé",null,"Année 1","Année 2","Année 3"]
[null,null,null,null,null,null,1,null,null,null,null,{"$f":"IF(K5=\"\",0%,VLOOKUP(K5,TVA,2,FALSE))","v":0},null,{"$f":"$L5/(1+$L5)","v":0},null,{"$f":"IF($B5=\"% PV\",D5*Ventes!D5/100,D5)","v":0},{"$f":"IF($B5=\"% PV\",E5*Ventes!E5/100,E5)","v":0},{"$f":"IF($B5=\"% PV\",F5*Ventes!F5/100,F5)","v":0}]
[null,null,null,null,null,null,1,null,null,null,null,0,null,{"$f":"$L6/(1+$L6)","v":0},null,{"$f":"IF($B6=\"% PV\",D6*Ventes!D6/100,D6)","v":0},{"$f":"IF($B6=\"% PV\",E6*Ventes!E6/100,E6)","v":0},{"$f":"IF($B6=\"% PV\",F6*Ventes!F6/100,F6)","v":0}]
[null,null,null,null,null,null,1,null,null,null,null,0,null,0,null,{"$f":"IF($B7=\"% PV\",D7*Ventes!D7/100,D7)","v":0},{"$f":"IF($B7=\"% PV\",E7*Ventes!E7/100,E7)","v":0},{"$f":"IF($B7=\"% PV\",F7*Ventes!F7/100,F7)","v":0}]
[null,null,null,null,null,null,1,null,null,null,null,0,null,0,null,{"$f":"IF($B8=\"% PV\",D8*Ventes!D8/100,D8)","v":0},{"$f":"IF($B8=\"% PV\",E8*Ventes!E8/100,E8)","v":0},{"$f":"IF($B8=\"% PV\",F8*Ventes!F8/100,F8)","v":0}]
[null,null,null,null,null,null,1,null,null,null,null,0,null,0,null,{"$f":"IF($B9=\"% PV\",D9*Ventes!D9/100,D9)","v":0},{"$f":"IF($B9=\"% PV\",E9*Ventes!E9/100,E9)","v":0},{"$f":"IF($B9=\"% PV\",F9*Ventes!F9/100,F9)","v":0}]
[null,null,null,null,null,null,1,null,null,null,null,0,null,0,null,{"$f":"IF($B10=\"% PV\",D10*Ventes!D10/100,D10)","v":0},{"$f":"IF($B10=\"% PV\",E10*Ventes!E10/100,E10)","v":0},{"$f":"IF($B10=\"% PV\",F10*Ventes!F10/100,F10)","v":0}]
[null,null,null,null,null,null,1,null,null,null,null,0,null,0,null,{"$f":"IF($B11=\"% PV\",D11*Ventes!D11/100,D11)","v":0},{"$f":"IF($B11=\"% PV\",E11*Ventes!E11/100,E11)","v":0},{"$f":"IF($B11=\"% PV\",F11*Ventes!F11/100,F11)","v":0}]
[null,null,null,null,null,null,1,null,null,null,null,0,null,0,null,{"$f":"IF($B12=\"% PV\",D12*Ventes!D12/100,D12)","v":0},{"$f":"IF($B12=\"% PV\",E12*Ventes!E12/100,E12)","v":0},{"$f":"IF($B12=\"% PV\",F12*Ventes!F12/100,F12)","v":0}]
[null,null,null,null,null,null,1,null,null,null,null,0,null,0,null,{"$f":"IF($B13=\"% PV\",D13*Ventes!D13/100,D13)","v":0},{"$f":"IF($B13=\"% PV\",E13*Ventes!E13/100,E13)","v":0},{"$f":"IF($B13=\"% PV\",F13*Ventes!F13/100,F13)","v":0}]
[null,null,null,null,null,null,1,null,null,null,null,0,null,0,null,{"$f":"IF($B14=\"% PV\",D14*Ventes!D14/100,D14)","v":0},{"$f":"IF($B14=\"% PV\",E14*Ventes!E14/100,E14)","v":0},{"$f":"IF($B14=\"% PV\",F14*Ventes!F14/100,F14)","v":0}]
["Services divers de sous-traitance",null,null,null,null,null,null,null,null,null,null,0,null,0]
{"$rows_left_out":231}
{"sheet":"Timing et RH","index":3,"n_rows":131,"n_cols":14,"rows_kept":131,"cut":false,"hidden":false,"merged":[[104,0,105,0],[104,1,104,13],[118,0,119,0],[118,1,118,13],[90,0,91,0],[90,1,90,13],[39,8,39,9],[40,8,40,9],[41,8,41,9],[42,8,42,9],[43,8,43,9],[44,8,44,9],[45,8,45,9],[46,8,46,9],[47,8,47,9],[48,8,48,9],[49,8,49,9],[77,0,78,0],[77,1,77,12],[46,1,46,2],[47,1,47,2],[48,1,48,2],[49,1,49,2],[51,0,52,0],[51,1,51,12],[64,0,65,0],[64,1,64,12],[43,1,43,2],[44,1,44,2],[45,1,45,2],[39,1,39,2],[40,1,40,2],[41,1,41,2],[42,1,42,2],[0,0,0,13],[14,0,15,0],[22,0,23,0],[30,0,31,0],[14,1,14,13],[30,1,30,13],[22,1,22,13]]}
["Définition des temps de production et des ressources humaines\n 1. Informez les temps nécessaires en approvisionnement, préparation, opérations et livraison pour chaque prestation\n 2. Vérifiez la cohérence des heures calculées par phase\n 3. Définissez les postes qui seront occupés, avec leur salaire (équivalent EPT), leur taux de charges sociales et d'éventuels défraiements mensuels fixes \n 4. Informez la quantité d'emplois mesnuels (1 EPT = 100%) nécessaires pour chaque poste"]
[]
["Temps de production unitaires","Approvi-sionnement","Unités\ntraitées\nen //","Approvi-sionnement\npar unité","Préparation","Unités\ntraitées\nen //","Préparation par unité","Opérations","Unités\ntraitées\nen //","Opérations par unité","Livraison","Unités\ntraitées\nen //","Livraison\npar unité","Temps total  par unité"]
[{"$f":"IF(Ventes!A5=\"\",\"\",Ventes!A5)","v":""},null,null,{"$f":"IF(C4<>0,B4/C4,\"\")","v":""},null,null,{"$f":"IF(F4<>0,E4/F4,\"\")","v":""},null,null,{"$f":"IF(I4<>0,H4/I4,\"\")","v":""},null,null,{"$f":"IF(L4<>0,K4/L4,\"\")","v":""},{"$f":"IF(D4<>\"\",D4,0) + IF(G4<>\"\",G4,0)+IF(J4<>\"\",J4,0)+IF(M4<>\"\",M4,0)","v":0}]
[{"$f":"IF(Ventes!A6=\"\",\"\",Ventes!A6)","v":""},null,null,"",null,null,"",null,null,"",null,null,"",0]
[{"$f":"IF(Ventes!A7=\"\",\"\",Ventes!A7)","v":""},null,null,"",null,null,"",null,null,"",null,null,"",0]
[{"$f":"IF(Ventes!A8=\"\",\"\",Ventes!A8)","v":""},null,null,{"$f":"IF(C7<>0,B7/C7,\"\")","v":""},null,null,{"$f":"IF(F7<>0,E7/F7,\"\")","v":""},null,null,{"$f":"IF(I7<>0,H7/I7,\"\")","v":""},null,null,{"$f":"IF(L7<>0,K7/L7,\"\")","v":""},{"$f":"IF(D7<>\"\",D7,0) + IF(G7<>\"\",G7,0)+IF(J7<>\"\",J7,0)+IF(M7<>\"\",M7,0)","v":0}]
[{"$f":"IF(Ventes!A9=\"\",\"\",Ventes!A9)","v":""},null,null,"",null,null,"",null,null,"",null,null,"",{"$f":"IF(D8<>\"\",D8,0) + IF(G8<>\"\",G8,0)+IF(J8<>\"\",J8,0)+IF(M8<>\"\",M8,0)","v":0}]
[{"$f":"IF(Ventes!A10=\"\",\"\",Ventes!A10)","v":""},null,null,"",null,null,"",null,null,"",null,null,"",{"$f":"IF(D9<>\"\",D9,0) + IF(G9<>\"\",G9,0)+IF(J9<>\"\",J9,0)+IF(M9<>\"\",M9,0)","v":0}]
[{"$f":"IF(Ventes!A11=\"\",\"\",Ventes!A11)","v":""},null,null,"",null,null,"",null,null,"",null,null,"",0]
[{"$f":"IF(Ventes!A12=\"\",\"\",Ventes!A12)","v":""},null,null,"",null,null,"",null,null,"",null,null,"",0]
[{"$f":"IF(Ventes!A13=\"\",\"\",Ventes!A13)","v":""},null,null,"",null,null,"",null,null,"",null,null,"",0]
[{"$f":"IF(Ventes!A14=\"\",\"\",Ventes!A14)","v":""},null,null,"",null,null,"",null,null,"",null,null,"",0]
[]
["Heures de production","Année 1"]
{"$rows_left_out":117}
{"sheet":"Charges fixes","index":4,"n_rows":97,"n_cols":13,"rows_kept":97,"cut":false,"hidden":false,"merged":[[0,0,0,12],[66,0,67,0],[66,1,66,12],[34,0,35,0],[34,1,34,12],[2,0,3,0],[2,1,2,12]]}
["Définition des charges fixes\n 1. Définissez les charges fixes mensuelles pour chacune des catégories (locaux, déplacements, administratifs, marketing et communication, frais généraux, exploitation et autres divers)\n 2. Seuls les totaux des catégories seront reportés dans la trésorerie"]
[]
["Charges fixes","Année 1"]
[null,{"$f":"Ventes!B$18","v":"2014-08-01"},{"$f":"Ventes!C$18","v":"2014-09-01"},{"$f":"Ventes!D$18","v":"2014-10-01"},{"$f":"Ventes!E$18","v":"2014-11-01"},{"$f":"Ventes!F$18","v":"2014-12-01"},{"$f":"Ventes!G$18","v":"2015-01-01"},{"$f":"Ventes!H$18","v":"2015-02-01"},{"$f":"Ventes!I$18","v":"2015-03-01"},{"$f":"Ventes!J$18","v":"2015-04-01"},{"$f":"Ventes!K$18","v":"2015-05-01"},{"$f":"Ventes!L$18","v":"2015-06-01"},{"$f":"Ventes!M$18","v":"2015-07-01"}]
["100 - Locaux",{"$f":"SUM(B6:B9)","v":0},{"$f":"SUM(C6:C9)","v":0},0,0,0,0,0,0,0,0,0,0]
["Loyers"]
["Charges (chauffage, conciergerie, taxes...)"]
["Electricité, eau, gaz"]
["Entretien et réparations, mainteance, ménage"]
["200 - Déplacements",{"$f":"SUM(B11:B14)","v":0},{"$f":"SUM(C11:C14)","v":0},0,0,0,0,0,0,0,0,0,0]
["Leasing, véhicules"]
["Entretien véhicules"]
["Taxes, impôts, assurances"]
["Transports-déplacements (publics ou privés)"]
["300 - Administratifs",{"$f":"SUM(B16:B18)","v":0},{"$f":"SUM(C16:C18)","v":0},0,0,0,0,0,0,0,0,0,0]
{"$rows_left_out":83}
{"sheet":"Investissements","index":5,"n_rows":55,"n_cols":14,"rows_kept":55,"cut":false,"hidden":false,"merged":[[38,0,39,0],[38,2,38,13],[2,1,3,1],[20,1,21,1],[38,1,39,1],[0,0,0,13],[2,0,3,0],[2,2,2,13],[20,0,21,0],[20,2,20,13]]}
["Définition des investissements\n - Listez vos investissements en les regroupant en un maximum de 15 ensembles en distinguant s'ils sont corporels ou incorporels\n - Marquez les dépenses mensuelles (à la date de leur paiement)"]
[]
["Investissements","Type\nd'immobilisation","Année 1"]
[null,null,{"$f":"Apports!C$15","v":"2014-08-01"},{"$f":"Apports!D$15","v":"2014-09-01"},{"$f":"Apports!E$15","v":"2014-10-01"},{"$f":"Apports!F$15","v":"2014-11-01"},{"$f":"Apports!G$15","v":"2014-12-01"},{"$f":"Apports!H$15","v":"2015-01-01"},{"$f":"Apports!I$15","v":"2015-02-01"},{"$f":"Apports!J$15","v":"2015-03-01"},{"$f":"Apports!K$15","v":"2015-04-01"},{"$f":"Apports!L$15","v":"2015-05-01"},{"$f":"Apports!M$15","v":"2015-06-01"},{"$f":"Apports!N$15","v":"2015-07-01"}]
[]
[]
[]
[]
[]
[]
[]
[]
[]
[]
[]
{"$rows_left_out":41}
{"sheet":"Apports","index":6,"n_rows":72,"n_cols":62,"rows_kept":72,"cut":false,"hidden":false,"merged":[[26,38,26,49],[13,38,13,49],[13,50,13,61],[26,26,26,37],[13,26,13,37],[26,50,26,61],[0,0,0,13],[2,4,2,6],[62,0,62,14],[40,0,40,14],[51,0,51,14],[13,0,15,0],[13,1,15,1],[26,2,26,13],[26,14,26,25],[13,2,13,13],[13,14,13,25],[26,0,28,0],[26,1,28,1],[24,0,24,1],[37,0,37,1]]}
["Définition des apports financiers\n 1. Définissez les apports financiers et leur forme (prêt, fonds propres, subvention ou donation), leur valeur, le mois de réception de l'argent (comptant depuis la date de la planification)\n 2. Pour les prêts, informez les taux d'intérêts, la durée de remboursement en années et le nombre de mois entre chaque échéance\n 3. Pour les subventions et les donations, n'informez aucune information de remboursement\n 4. Vérifiez l'étalement des mensualités de remboursement sur 5 ans si nécessaire\n 5. Consultez les tableaux de calculs de la TVA, si nécessaire"]
[]
[null,null,null,null,"Remboursement"]
["Apport de fonds","Type","Valeur de l'apport","Mois de réception","Taux annuel\nen %","Sur…\nannées","Intervalle des échéances"]
[]
[]
[]
[]
[]
[]
[]
[]
[]
["Versement des apports",null,"Année 1",null,null,null,null,null,null,null,null,null,null,null,"Année 2",null,null,null,null,null,null,null,null,null,null,null,"Année 3",null,null,null,null,null,null,null,null,null,null,null,"Année 4",null,null,null,null,null,null,null,null,null,null,null,"Année 5"]
[null,null,{"$f":"DATE(YEAR(Intro!C3),MONTH(Intro!C3),DAY(Intro!C3))","v":"2014-08-01"},{"$f":"DATE(YEAR(C15),MONTH(C15)+1,DAY(C15))","v":"2014-09-01"},"2014-10-01","2014-11-01","2014-12-01","2015-01-01","2015-02-01","2015-03-01","2015-04-01","2015-05-01","2015-06-01","2015-07-01",{"$f":"DATE(YEAR(Apports!C15)+1,MONTH(Apports!C15),DAY(Apports!C15))","v":"2015-08-01"},{"$f":"DATE(YEAR(Apports!D15)+1,MONTH(Apports!D15),DAY(Apports!D15))","v":"2015-09-01"},{"$f":"DATE(YEAR(Apports!E15)+1,MONTH(Apports!E15),DAY(Apports!E15))","v":"2015-10-01"},{"$f":"DATE(YEAR(Apports!F15)+1,MONTH(Apports!F15),DAY(Apports!F15))","v":"2015-11-01"},{"$f":"DATE(YEAR(Apports!G15)+1,MONTH(Apports!G15),DAY(Apports!G15))","v":"2015-12-01"},{"$f":"DATE(YEAR(Apports!H15)+1,MONTH(Apports!H15),DAY(Apports!H15))","v":"2016-01-01"},{"$f":"DATE(YEAR(Apports!I15)+1,MONTH(Apports!I15),DAY(Apports!I15))","v":"2016-02-01"},{"$f":"DATE(YEAR(Apports!J15)+1,MONTH(Apports!J15),DAY(Apports!J15))","v":"2016-03-01"},{"$f":"DATE(YEAR(Apports!K15)+1,MONTH(Apports!K15),DAY(Apports!K15))","v":"2016-04-01"},{"$f":"DATE(YEAR(Apports!L15)+1,MONTH(Apports!L15),DAY(Apports!L15))","v":"2016-05-01"},{"$f":"DATE(YEAR(Apports!M15)+1,MONTH(Apports!M15),DAY(Apports!M15))","v":"2016-06-01"},{"$f":"DATE(YEAR(Apports!N15)+1,MONTH(Apports!N15),DAY(Apports!N15))","v":"2016-07-01"},{"$f":"DATE(YEAR(Apports!O15)+1,MONTH(Apports!O15),DAY(Apports!O15))","v":"2016-08-01"},{"$f":"DATE(YEAR(Apports!P15)+1,MONTH(Apports!P15),DAY(Apports!P15))","v":"2016-09-01"},{"$f":"DATE(YEAR(Apports!Q15)+1,MONTH(Apports!Q15),DAY(Apports!Q15))","v":"2016-10-01"},{"$f":"DATE(YEAR(Apports!R15)+1,MONTH(Apports!R15),DAY(Apports!R15))","v":"2016-11-01"},{"$f":"DATE(YEAR(Apports!S15)+1,MONTH(Apports!S15),DAY(Apports!S15))","v":"2016-12-01"},{"$f":"DATE(YEAR(Apports!T15)+1,MONTH(Apports!T15),DAY(Apports!T15))","v":"2017-01-01"},{"$f":"DATE(YEAR(Apports!U15)+1,MONTH(Apports!U15),DAY(Apports!U15))","v":"2017-02-01"},{"$f":"DATE(YEAR(Apports!V15)+1,MONTH(Apports!V15),DAY(Apports!V15))","v":"2017-03-01"},{"$f":"DATE(YEAR(Apports!W15)+1,MONTH(Apports!W15),DAY(Apports!W15))","v":"2017-04-01"},{"$f":"DATE(YEAR(Apports!X15)+1,MONTH(Apports!X15),DAY(Apports!X15))","v":"2017-05-01"},{"$f":"DATE(YEAR(Apports!Y15)+1,MONTH(Apports!Y15),DAY(Apports!Y15))","v":"2017-06-01"},{"$f":"DATE(YEAR(Apports!Z15)+1,MONTH(Apports!Z15),DAY(Apports!Z15))","v":"2017-07-01"},{"$f":"DATE(YEAR(Apports!AA15)+1,MONTH(Apports!AA15),DAY(Apports!AA15))","v":"2017-08-01"},{"$f":"DATE(YEAR(Apports!AB15)+1,MONTH(Apports!AB15),DAY(Apports!AB15))","v":"2017-09-01"},{"$f":"DATE(YEAR(Apports!AC15)+1,MONTH(Apports!AC15),DAY(Apports!AC15))","v":"2017-10-01"},{"$f":"DATE(YEAR(Apports!AD15)+1,MONTH(Apports!AD15),DAY(Apports!AD15))","v":"2017-11-01"},{"$f":"DATE(YEAR(Apports!AE15)+1,MONTH(Apports!AE15),DAY(Apports!AE15))","v":"2017-12-01"},{"$f":"DATE(YEAR(Apports!AF15)+1,MONTH(Apports!AF15),DAY(Apports!AF15))","v":"2018-01-01"},{"$f":"DATE(YEAR(Apports!AG15)+1,MONTH(Apports!AG15),DAY(Apports!AG15))","v":"2018-02-01"},{"$f":"DATE(YEAR(Apports!AH15)+1,MONTH(Apports!AH15),DAY(Apports!AH15))","v":"2018-03-01"},{"$f":"DATE(YEAR(Apports!AI15)+1,MONTH(Apports!AI15),DAY(Apports!AI15))","v":"2018-04-01"},{"$f":"DATE(YEAR(Apports!AJ15)+1,MONTH(Apports!AJ15),DAY(Apports!AJ15))","v":"2018-05-01"},{"$f":"DATE(YEAR(Apports!AK15)+1,MONTH(Apports!AK15),DAY(Apports!AK15))","v":"2018-06-01"},{"$f":"DATE(YEAR(Apports!AL15)+1,MONTH(Apports!AL15),DAY(Apports!AL15))","v":"2018-07-01"},{"$f":"DATE(YEAR(Apports!AM15)+1,MONTH(Apports!AM15),DAY(Apports!AM15))","v":"2018-08-01"},{"$f":"DATE(YEAR(Apports!AN15)+1,MONTH(Apports!AN15),DAY(Apports!AN15))","v":"2018-09-01"},{"$f":"DATE(YEAR(Apports!AO15)+1,MONTH(Apports!AO15),DAY(Apports!AO15))","v":"2018-10-01"},{"$f":"DATE(YEAR(Apports!AP15)+1,MONTH(Apports!AP15),DAY(Apports!AP15))","v":"2018-11-01"},{"$f":"DATE(YEAR(Apports!AQ15)+1,MONTH(Apports!AQ15),DAY(Apports!AQ15))","v":"2018-12-01"},{"$f":"DATE(YEAR(Apports!AR15)+1,MONTH(Apports!AR15),DAY(Apports!AR15))","v":"2019-01-01"},{"$f":"DATE(YEAR(Apports!AS15)+1,MONTH(Apports!AS15),DAY(Apports!AS15))","v":"2019-02-01"},{"$f":"DATE(YEAR(Apports!AT15)+1,MONTH(Apports!AT15),DAY(Apports!AT15))","v":"2019-03-01"},{"$f":"DATE(YEAR(Apports!AU15)+1,MONTH(Apports!AU15),DAY(Apports!AU15))","v":"2019-04-01"},{"$f":"DATE(YEAR(Apports!AV15)+1,MONTH(Apports!AV15),DAY(Apports!AV15))","v":"2019-05-01"},{"$f":"DATE(YEAR(Apports!AW15)+1,MONTH(Apports!AW15),DAY(Apports!AW15))","v":"2019-06-01"},{"$f":"DATE(YEAR(Apports!AX15)+1,MONTH(Apports!AX15),DAY(Apports!AX15))","v":"2019-07-01"}]
{"$rows_left_out":58}
{"sheet":"Trésorerie","index":7,"n_rows":99,"n_cols":15,"rows_kept":99,"cut":false,"hidden":false,"merged":[[35,0,36,0],[35,1,36,1],[35,2,35,13],[35,14,36,14],[68,0,69,0],[68,1,69,1],[68,2,68,13],[68,14,69,14],[2,2,2,13],[2,14,3,14],[2,0,3,0],[2,1,3,1],[0,0,0,14]]}
["Tableaux de trésorerie\n 1. Vérifiez les recettes et les dépenses\n 2. Informez le pourcentage de la masse salariale réservé pour les frais de formation\n 3. Vérifiez le compte de résultats\n 4. Informez un éventuel solde de trésorerie qui ne figurerait pas dans le tableau des apports\n 5. Suivez l'évolution des résultats accumulés (trésorerie)"]
[]
["Recettes",null,"Année 1",null,null,null,null,null,null,null,null,null,null,null,"Totaux"]
[null,null,{"$f":"Apports!C$15","v":"2014-08-01"},{"$f":"Apports!D$15","v":"2014-09-01"},{"$f":"Apports!E$15","v":"2014-10-01"},{"$f":"Apports!F$15","v":"2014-11-01"},{"$f":"Apports!G$15","v":"2014-12-01"},{"$f":"Apports!H$15","v":"2015-01-01"},{"$f":"Apports!I$15","v":"2015-02-01"},{"$f":"Apports!J$15","v":"2015-03-01"},{"$f":"Apports!K$15","v":"2015-04-01"},{"$f":"Apports!L$15","v":"2015-05-01"},{"$f":"Apports!M$15","v":"2015-06-01"},{"$f":"Ventes!M18","v":"2015-07-01"}]
["Ventes encaissées",null,{"$f":"Ventes!B154","v":0},{"$f":"Ventes!C154","v":0},{"$f":"Ventes!D154","v":0},{"$f":"Ventes!E154","v":0},{"$f":"Ventes!F154","v":0},{"$f":"Ventes!G154","v":0},{"$f":"Ventes!H154","v":0},{"$f":"Ventes!I154","v":0},{"$f":"Ventes!J154","v":0},{"$f":"Ventes!K154","v":0},{"$f":"Ventes!L154","v":0},{"$f":"Ventes!M154","v":0},{"$f":"SUM(C5:N5)","v":0}]
["Remises sur les prix de vente, soldes, rabais",null,{"$f":"-Ventes!B198","v":0},{"$f":"-Ventes!C198","v":0},{"$f":"-Ventes!D198","v":0},{"$f":"-Ventes!E198","v":0},{"$f":"-Ventes!F198","v":0},{"$f":"-Ventes!G198","v":0},{"$f":"-Ventes!H198","v":0},{"$f":"-Ventes!I198","v":0},{"$f":"-Ventes!J198","v":0},{"$f":"-Ventes!K198","v":0},{"$f":"-Ventes!L198","v":0},{"$f":"-Ventes!M198","v":0},{"$f":"SUM(C6:N6)","v":0}]
["Recettes hors exploitation",null,{"$f":"Ventes!B29","v":0},{"$f":"Ventes!C29","v":0},{"$f":"Ventes!D29","v":0},{"$f":"Ventes!E29","v":0},{"$f":"Ventes!F29","v":0},{"$f":"Ventes!G29","v":0},{"$f":"Ventes!H29","v":0},{"$f":"Ventes!I29","v":0},{"$f":"Ventes!J29","v":0},{"$f":"Ventes!K29","v":0},{"$f":"Ventes!L29","v":0},{"$f":"Ventes!M29","v":0},0]
["Total des recettes",null,{"$f":"SUM(C5:C7)","v":0},{"$f":"SUM(D5:D7)","v":0},0,0,0,0,0,0,0,0,0,0,0]
["Apports financiers propres et étrangers",null,{"$f":"Apports!C25","v":""},{"$f":"Apports!D25","v":""},{"$f":"Apports!E25","v":""},{"$f":"Apports!F25","v":""},{"$f":"Apports!G25","v":""},{"$f":"Apports!H25","v":""},{"$f":"Apports!I25","v":""},{"$f":"Apports!J25","v":""},{"$f":"Apports!K25","v":""},{"$f":"Apports!L25","v":""},{"$f":"Apports!M25","v":""},{"$f":"Apports!N25","v":""},0]
["Total des entrées",null,{"$f":"SUM(C8:C9)","v":0},0,0,0,0,0,0,0,0,0,0,0,{"$f":"SUM(C10:N10)","v":0}]
["Charges variables et fixes",null,{"$f":"Apports!C$15","v":"2014-08-01"},{"$f":"Apports!D$15","v":"2014-09-01"},{"$f":"Apports!E$15","v":"2014-10-01"},{"$f":"Apports!F$15","v":"2014-11-01"},{"$f":"Apports!G$15","v":"2014-12-01"},{"$f":"Apports!H$15","v":"2015-01-01"},{"$f":"Apports!I$15","v":"2015-02-01"},{"$f":"Apports!J$15","v":"2015-03-01"},{"$f":"Apports!K$15","v":"2015-04-01"},{"$f":"Apports!L$15","v":"2015-05-01"},{"$f":"Apports!M$15","v":"2015-06-01"},{"$f":"Apports!N$15","v":"2015-07-01"},"Totaux"]
["Achat de marchandises",null,{"$f":"-Achats!B213","v":0},{"$f":"-Achats!C213","v":0},{"$f":"-Achats!D213","v":0},{"$f":"-Achats!E213","v":0},{"$f":"-Achats!F213","v":0},{"$f":"-Achats!G213","v":0},{"$f":"-Achats!H213","v":0},{"$f":"-Achats!I213","v":0},{"$f":"-Achats!J213","v":0},{"$f":"-Achats!K213","v":0},{"$f":"-Achats!L213","v":0},{"$f":"-Achats!M213","v":0},{"$f":"SUM(C12:N12)","v":0}]
["Sous-traitance occasionnelle",null,{"$f":"-Achats!B53*Achats!$D$15","v":0},{"$f":"-Achats!C53*Achats!$D$15","v":0},{"$f":"-Achats!D53*Achats!$D$15","v":0},{"$f":"-Achats!E53*Achats!$D$15","v":0},{"$f":"-Achats!F53*Achats!$D$15","v":0},{"$f":"-Achats!G53*Achats!$D$15","v":0},{"$f":"-Achats!H53*Achats!$D$15","v":0},{"$f":"-Achats!I53*Achats!$D$15","v":0},{"$f":"-Achats!J53*Achats!$D$15","v":0},{"$f":"-Achats!K53*Achats!$D$15","v":0},{"$f":"-Achats!L53*Achats!$D$15","v":0},{"$f":"-Achats!M53*Achats!$D$15","v":0},0]
["Salaires et charges sociales",null,{"$f":"-'Timing et RH'!B103","v":0},{"$f":"-'Timing et RH'!C103","v":0},{"$f":"-'Timing et RH'!D103","v":0},{"$f":"-'Timing et RH'!E103","v":0},{"$f":"-'Timing et RH'!F103","v":0},{"$f":"-'Timing et RH'!G103","v":0},{"$f":"-'Timing et RH'!H103","v":0},{"$f":"-'Timing et RH'!I103","v":0},{"$f":"-'Timing et RH'!J103","v":0},{"$f":"-'Timing et RH'!K103","v":0},{"$f":"-'Timing et RH'!L103","v":0},{"$f":"-'Timing et RH'!M103","v":0},0]
["Frais de formation",0.02,{"$f":"$B$15*C14","v":0},{"$f":"$B$15*D14","v":0},0,0,0,0,0,0,0,0,0,0,0]
{"$rows_left_out":85}
{"sheet":"Tables","index":8,"n_rows":8,"n_cols":13,"rows_kept":8,"cut":false,"hidden":false,"merged":[]}
["Unités de prestation",null,"Unité de composant",null,"TVA sur:","Taux",null,"Délais","Mois",null,"Immobilisations",null,"Type d'apport"]
["Service",null,"Kg",null,"Exempt",0,null,"Sans",0,null,"Corporelle / matérielle",null,"Fonds propres"]
["Pièce",null,"Litre",null,"Services",0.08,null,"<=1 mois",1,null,"Incorporelle / immatérielle",null,"Prêt"]
["Heure",null,"CHF",null,"Hébergement",3.7999999999999999E-2,null,"<=2 mois",2,null,null,null,"Subvention"]
["Kg",null,"% PV",null,"Nourriture",2.5000000000000001E-2,null,"<=3 mois",3,null,null,null,"Donation"]
["Litre",null,"Autre"]
["M2"]
["Autre"]